{"text_format":"1","workbook":"xlsx","n_sheets":9,"sheets":["Uputstvo","Podaci o računu","Račun ME","Račun SL","Račun HR","Kupci","Izdavaoci","Artikli","Šifranti"],"not_rendered":{"charts":0,"images":3,"macros":1,"external_links":1,"defined_names":6,"comments":0,"pivot_tables":0},"unopened":[],"bounds":{"document_bytes":16777216,"sheet_cells":100000,"rows_first":2000,"rows_last":500,"rows_between":2000,"halvings":0,"cell_chars":16384,"cell_head_chars":4096},"cells_cut":0,"cells_raw":0,"read":"whole","date_system":"1900"}

{"sheet":"Uputstvo","index":0,"n_rows":76,"n_cols":3,"rows_kept":76,"cut":false,"hidden":false,"merged":[]}
[]
[]
[]
[null,null,"Excel eRačun"]
[]
[]
[null,null,"Alat za pripremu eRačuna po standardu e-SLOG."]
[]
[null,null,"ZZI je na predlog korisnika razvio besplatan alat za unos artikala i automatsko generisanje e-SLOG računa sa PDF vizualizacijom.partnerjev, artiklov ter avtomatsko izdelavo e-SLOG računa s PDF vizualizacijo."]
[]
[null,null,"Nakon kreiranja vaše e-fakture, još uvek je morate da je digitalno potpišete i pošaljete primaocu, jer se ova dva koraka ne izvršavaju automatski u trenutnoj verziji bizBox Ekcel e-Računa"]
[null,null,"Koristite bizBox eRazmjena uslugu da biste to učinili. Sve što trebate je aktivni bizBox račun ili instalacija besplatnog ZZInet klijenta kako bi korisnik osigurao da primaocu računa sigurno i pouzdano dođe i da troškovi slanja budu manji od troškova klasične pošte."]
[null,null,"Bez obzira na korišćenje usluge eRazmjena, preporučujemo da se registrujete na veb portalu www.bizbox.eu, koji vam omogućava da besplatno pregledate dokumente primljene u e-poštanskom sandučiću."]
[]
[null,null,"Za omogućivanje usluge možete nas kontaktirati na info@zzi.co.me ili 067 233 425."]
{"$rows_left_out":62}
{"sheet":"Podaci o računu","index":1,"n_rows":50,"n_cols":24,"rows_kept":50,"cut":false,"hidden":false,"merged":[[19,1,20,1],[19,2,20,2],[19,6,19,8],[20,6,20,8],[21,6,21,8],[24,16,25,16],[33,1,34,1],[33,2,34,2],[24,4,25,4],[24,5,25,5],[24,6,25,6],[24,7,25,7],[24,8,25,8],[24,9,25,9],[24,10,25,10],[24,11,25,11],[24,12,25,12],[24,13,25,13],[24,14,25,14],[24,15,25,15],[3,5,4,8],[3,1,4,1],[3,2,4,2],[22,6,22,8],[14,6,14,8],[15,6,15,8],[16,6,16,8],[17,6,17,8],[18,6,18,8],[6,6,6,8],[7,6,7,8],[10,6,10,8],[11,6,11,8],[13,6,13,8],[8,6,8,8],[9,6,9,8]]}
[]
[null,"bizBox Excel eRačun za eSLOG 2.0",null,null,null,null,null,null,null,null,null,null,null,null,null,null,null,null,null,null,"prikaz iz šifranta"]
[null,null,null,null,null,null,null,null,null,null,null,null,null,null,null,null,null,null,null,null,"izdajatelj",{"$f":"MATCH(C4,Izdavaoci!C3:E3,0)","v":1}]
[null,"Izdavaoci","ZZI doo Podgorica",null,null,"Podaci o računu",null,null,null,null,null,null,null,null,null,null,null,null,null,null,"plačnik",{"$f":"MATCH(C20,Kupci!P3:P1000,0)","v":2}]
[null,null,null,null,null,null,null,null,null,null,null,null,null,null,null,null,null,null,null,null,"prejemnik",{"$f":"MATCH(C34,Kupci!P3:P1000,0)","v":2}]
[null,"Naziv preduzeća",{"$f":"IF(INDEX(Izdavaoci!$C$3:$E$18,ROW(B2),$V$3)=0,\"\",INDEX(Izdavaoci!$C$3:$E$18,ROW(B2),$V$3))","v":"ZZI doo Podgorica"},null,null,"Vrsta računa","Račun","Poslovni proces","P1"]
[null,"Mjesto preduzeća",{"$f":"IF(INDEX(Izdavaoci!$C$3:$E$18,ROW(B3),$V$3)=0,\"\",INDEX(Izdavaoci!$C$3:$E$18,ROW(B3),$V$3))","v":"ul Moskovska 77"},null,null,"Broj računa"]
[null,"Poštanski broj",{"$f":"IF(INDEX(Izdavaoci!$C$3:$E$18,ROW(B4),$V$3)=0,\"\",INDEX(Izdavaoci!$C$3:$E$18,ROW(B4),$V$3))","v":81000},null,null,"Veza (referenca)"]
[null,"Grad",{"$f":"IF(INDEX(Izdavaoci!$C$3:$E$18,ROW(B5),$V$3)=0,\"\",INDEX(Izdavaoci!$C$3:$E$18,ROW(B5),$V$3))","v":"Podgorica"},null,null,"Valuta računa","EUR",null,null,null,null,null,null,null,null,"www.bizbox.eu"]
[null,"Država",{"$f":"IF(INDEX(Izdavaoci!$C$3:$E$18,ROW(B6),$V$3)=0,\"\",INDEX(Izdavaoci!$C$3:$E$18,ROW(B6),$V$3))","v":"ME"},null,null,"Datum izdavanja računa",null,null,null,null,null,"Autor ZZI d.o.o.",null,null,null,"www.zzi.me"]
[null,"Kontakt osoba",{"$f":"IF(INDEX(Izdavaoci!$C$3:$E$18,ROW(B7),$V$3)=0,\"\",INDEX(Izdavaoci!$C$3:$E$18,ROW(B7),$V$3))","v":"Jelena Milojković"},null,null,"Datum valute"]
[null,"E-pošta",{"$f":"IF(INDEX(Izdavaoci!$C$3:$E$18,ROW(B8),$V$3)=0,\"\",INDEX(Izdavaoci!$C$3:$E$18,ROW(B8),$V$3))","v":"info@zzi.co.me"},null,null,"Datum izvršenja usluge"]
[null,"Telefon",{"$f":"IF(INDEX(Izdavaoci!$C$3:$E$18,ROW(B9),$V$3)=0,\"\",INDEX(Izdavaoci!$C$3:$E$18,ROW(B9),$V$3))","v":38220229560},null,null,"Vrijeme usluge OD",null,"DO",null,null,"bizBox Excel eRačun je besplatan alat za izradu eRačuna u formatu e-Slog 2.0 "]
[null,"Matični broj",{"$f":"IF(INDEX(Izdavaoci!$C$3:$E$18,ROW(B10),$V$3)=0,\"\",INDEX(Izdavaoci!$C$3:$E$18,ROW(B10),$V$3))","v":"02328097"},null,null,"Referentni dokument",null,null,null,null,"sa vizualizacijom u PDF-u"]
[null,"Poreski broj",{"$f":"IF(INDEX(Izdavaoci!$C$3:$E$18,ROW(B11),$V$3)=0,\"\",INDEX(Izdavaoci!$C$3:$E$18,ROW(B11),$V$3))","v":"02328097"},null,null,"Broj referentnog dokumenta",null,null,null,null,"Detaljna uputstva za korišćenje alata pogledajte na listu UPUTSTVO."]
{"$rows_left_out":36}
{"sheet":"Račun ME","index":2,"n_rows":56,"n_cols":15,"rows_kept":56,"cut":false,"hidden":false,"merged":[[39,11,39,12],[44,11,44,12],[43,11,43,12],[42,11,42,12],[41,11,41,12],[40,11,40,12],[34,1,34,3],[35,1,35,3],[36,1,36,3],[37,1,37,3],[29,1,29,3],[30,1,30,3],[31,1,31,3],[32,1,32,3],[33,1,33,3],[15,1,15,12],[17,1,17,3],[50,1,51,12],[52,1,53,12],[54,1,54,12],[18,1,18,3],[19,1,19,3],[20,1,20,3],[21,1,21,3],[22,1,22,3],[23,1,23,3],[24,1,24,3],[25,1,25,3],[26,1,26,3],[27,1,27,3],[28,1,28,3]]}
[null,{"$f":"'Podaci o računu'!C6&\", \"&'Podaci o računu'!C7&\", \"&'Podaci o računu'!C8&\" \"&'Podaci o računu'!C9&\", \"&'Podaci o računu'!C10","v":"ZZI doo Podgorica, ul Moskovska 77, 81000 Podgorica, ME"}]
[null,{"$f":"IF('Podaci o računu'!C11<>\"\",\"\"&'Podaci o računu'!C11&\", E: \"&'Podaci o računu'!C12&\", T: \"&'Podaci o računu'!C13,\"\"&\"E: \"&'Podaci o računu'!C12&\", T: \"&'Podaci o računu'!C13)","v":"Jelena Milojković, E: info@zzi.co.me, T: 38220229560"}]
[null,{"$f":"IF('Podaci o računu'!C16=\"DA\",\"PDV ID: \"&'Podaci o računu'!C10&'Podaci o računu'!C15,\"Poreski Broj: \"&'Podaci o računu'!C15)","v":"PDV ID: ME02328097"}]
[null,{"$f":"\"IBAN: \"&'Podaci o računu'!C17&\", BIC: \"&'Podaci o računu'!C18","v":"IBAN: , BIC: "}]
[]
[null,"KUPAC",null,null,null,"PRIMALAC",null,null,null,{"$f":"'Podaci o računu'!G6&\" br. \"&'Podaci o računu'!G7","v":"Račun br. "}]
[null,{"$f":"'Podaci o računu'!C22","v":"ZZI doo Podgorica"},null,null,null,{"$f":"'Podaci o računu'!C36","v":"ZZI doo Podgorica"},null,null,null,"Datum izdavanja",null,null,{"$f":"TEXT('Podaci o računu'!G10,\"dd.mm.yyyy\")","v":"00.01.1900"}]
[null,{"$f":"'Podaci o računu'!C23","v":"Vladimir Ćetković"},null,null,null,{"$f":"'Podaci o računu'!C37","v":"Vladimir Ćetković"},null,null,null,"Datum usluge/isporuke robe",null,null,{"$f":"IF('Podaci o računu'!G12=\"\",\"-\",\"\"&TEXT('Podaci o računu'!G12,\"dd.mm.yyyy\"))","v":"-"}]
[null,{"$f":"'Podaci o računu'!C24","v":"ul. Moskovska 77"},null,null,null,{"$f":"'Podaci o računu'!C38","v":"ul. Moskovska 77"},null,null,null,"Razdoblje usluge",null,null,{"$f":"IF(OR('Podaci o računu'!G13=\"\",'Podaci o računu'!I13=\"\"),\"-\",\"\"&TEXT('Podaci o računu'!G13,\"dd.mm.yyyy\")&\" do \"&TEXT('Podaci o računu'!I13,\"dd.mm.yyyy\"))","v":"-"}]
[null,{"$f":"'Podaci o računu'!C25&\" \"&'Podaci o računu'!C26","v":"81000 Podgorica"},null,null,null,{"$f":"'Podaci o računu'!C39&\" \"&'Podaci o računu'!C40","v":"81000 Podgorica"},null,null,null,"Datum dospijeća",null,null,{"$f":"TEXT('Podaci o računu'!G11,\"dd.mm.yyyy\")","v":"00.01.1900"}]
[null,{"$f":"'Podaci o računu'!C27","v":"ME"},null,null,null,{"$f":"'Podaci o računu'!C41","v":"ME"},null,null,null,"Referentni dokument",null,null,{"$f":"'Podaci o računu'!G14&\" \"&'Podaci o računu'!G15","v":" "}]
[null,{"$f":"IF('Podaci o računu'!C30=\"DA\",\"PDV ID: \"&'Podaci o računu'!C27&'Podaci o računu'!C29,\"Poreski broj: \"&'Podaci o računu'!C29)","v":"PDV ID: ME02328097"},null,null,null,null,null,null,null,"Poziv na broj",null,null,{"$f":"IF('Podaci o računu'!G8=\"\",\"\",'Podaci o računu'!G8)","v":""}]
[null,{"$f":"'Podaci o računu'!C31&IF(AND('Podaci o računu'!C31<>\"\",'Podaci o računu'!C32<>\"\"),\", \",\"\")&'Podaci o računu'!C32","v":""},null,null,null,null,null,null,null,"Šifra namjene",null,null,{"$f":"'Podaci o računu'!G17","v":"OTHR"}]
[null,null,null,null,null,null,null,null,null,"Mjesto troška",null,null,{"$f":"IF('Podaci o računu'!G20=\"\",\"\",'Podaci o računu'!G20)","v":""}]
[]
{"$rows_left_out":42}
{"sheet":"Račun SL","index":3,"n_rows":56,"n_cols":15,"rows_kept":56,"cut":false,"hidden":false,"merged":[[27,1,27,3],[15,1,15,12],[17,1,17,3],[18,1,18,3],[19,1,19,3],[20,1,20,3],[21,1,21,3],[22,1,22,3],[23,1,23,3],[24,1,24,3],[25,1,25,3],[26,1,26,3],[40,11,40,12],[28,1,28,3],[29,1,29,3],[30,1,30,3],[31,1,31,3],[32,1,32,3],[33,1,33,3],[34,1,34,3],[35,1,35,3],[36,1,36,3],[37,1,37,3],[39,11,39,12],[54,1,54,12],[41,11,41,12],[42,11,42,12],[43,11,43,12],[44,11,44,12],[50,1,51,12],[52,1,53,12]]}
[null,{"$f":"'Podaci o računu'!C6&\", \"&'Podaci o računu'!C7&\", \"&'Podaci o računu'!C8&\" \"&'Podaci o računu'!C9&\", \"&'Podaci o računu'!C10","v":"ZZI doo Podgorica, ul Moskovska 77, 81000 Podgorica, ME"}]
[null,{"$f":"IF('Podaci o računu'!C11<>\"\",\"\"&'Podaci o računu'!C11&\", E: \"&'Podaci o računu'!C12&\", T: \"&'Podaci o računu'!C13,\"\"&\"E: \"&'Podaci o računu'!C12&\", T: \"&'Podaci o računu'!C13)","v":"Jelena Milojković, E: info@zzi.co.me, T: 38220229560"}]
[null,{"$f":"IF('Podaci o računu'!C16=\"DA\",\"ID za DDV: \"&'Podaci o računu'!C10&'Podaci o računu'!C15,\"Davčna številka: \"&'Podaci o računu'!C15)","v":"ID za DDV: ME02328097"}]
[null,{"$f":"\"IBAN: \"&'Podaci o računu'!C17&\", BIC: \"&'Podaci o računu'!C18","v":"IBAN: , BIC: "}]
[]
[null,"KUPEC",null,null,null,"PREJEMNIK BLAGA",null,null,null,{"$f":"'Podaci o računu'!G6&\" št. \"&'Podaci o računu'!G7","v":"Račun št. "}]
[null,{"$f":"'Podaci o računu'!C22","v":"ZZI doo Podgorica"},null,null,null,{"$f":"'Podaci o računu'!C36","v":"ZZI doo Podgorica"},null,null,null,"Datum izdaje računa",null,null,{"$f":"TEXT('Podaci o računu'!G10,\"dd.mm.yyyy\")","v":"00.01.1900"}]
[null,{"$f":"'Podaci o računu'!C23","v":"Vladimir Ćetković"},null,null,null,{"$f":"'Podaci o računu'!C37","v":"Vladimir Ćetković"},null,null,null,"Datum storitve/dobave blaga",null,null,{"$f":"IF('Podaci o računu'!G12=\"\",\"-\",\"\"&TEXT('Podaci o računu'!G12,\"dd.mm.yyyy\"))","v":"-"}]
[null,{"$f":"'Podaci o računu'!C24","v":"ul. Moskovska 77"},null,null,null,{"$f":"'Podaci o računu'!C38","v":"ul. Moskovska 77"},null,null,null,"Obdobje storitve",null,null,{"$f":"IF(OR('Podaci o računu'!G13=\"\",'Podaci o računu'!I13=\"\"),\"-\",\"\"&TEXT('Podaci o računu'!G13,\"dd.mm.yyyy\")&\" do \"&TEXT('Podaci o računu'!I13,\"dd.mm.yyyy\"))","v":"-"}]
[null,{"$f":"'Podaci o računu'!C25&\" \"&'Podaci o računu'!C26","v":"81000 Podgorica"},null,null,null,{"$f":"'Podaci o računu'!C39&\" \"&'Podaci o računu'!C40","v":"81000 Podgorica"},null,null,null,"Datum zapadlosti",null,null,{"$f":"TEXT('Podaci o računu'!G11,\"dd.mm.yyyy\")","v":"00.01.1900"}]
[null,{"$f":"'Podaci o računu'!C27","v":"ME"},null,null,null,{"$f":"'Podaci o računu'!C41","v":"ME"},null,null,null,"Referenčni dokument",null,null,{"$f":"'Podaci o računu'!G14&\" \"&'Podaci o računu'!G15","v":" "}]
[null,{"$f":"IF('Podaci o računu'!C30=\"DA\",\"ID za DDV: \"&'Podaci o računu'!C27&'Podaci o računu'!C29,\"Davčna številka: \"&'Podaci o računu'!C29)","v":"ID za DDV: ME02328097"},null,null,null,null,null,null,null,"Sklic nakazila",null,null,{"$f":"IF('Podaci o računu'!G8=\"\",\"\",'Podaci o računu'!G8)","v":""}]
[null,{"$f":"'Podaci o računu'!C31&IF(AND('Podaci o računu'!C31<>\"\",'Podaci o računu'!C32<>\"\"),\", \",\"\")&'Podaci o računu'!C32","v":""},null,null,null,null,null,null,null,"Koda namena",null,null,{"$f":"'Podaci o računu'!G17","v":"OTHR"}]
[null,null,null,null,null,null,null,null,null,"Stroškovno mesto",null,null,{"$f":"IF('Podaci o računu'!G20=\"\",\"\",'Podaci o računu'!G20)","v":""}]
[]
{"$rows_left_out":42}
{"sheet":"Račun HR","index":4,"n_rows":56,"n_cols":15,"rows_kept":56,"cut":false,"hidden":false,"merged":[[27,1,27,3],[15,1,15,12],[17,1,17,3],[18,1,18,3],[19,1,19,3],[20,1,20,3],[21,1,21,3],[22,1,22,3],[23,1,23,3],[24,1,24,3],[25,1,25,3],[26,1,26,3],[40,11,40,12],[28,1,28,3],[29,1,29,3],[30,1,30,3],[31,1,31,3],[32,1,32,3],[33,1,33,3],[34,1,34,3],[35,1,35,3],[36,1,36,3],[37,1,37,3],[39,11,39,12],[54,1,54,12],[41,11,41,12],[42,11,42,12],[43,11,43,12],[44,11,44,12],[50,1,51,12],[52,1,53,12]]}
[null,{"$f":"'Podaci o računu'!C6&\", \"&'Podaci o računu'!C7&\", \"&'Podaci o računu'!C8&\" \"&'Podaci o računu'!C9&\", \"&'Podaci o računu'!C10","v":"ZZI doo Podgorica, ul Moskovska 77, 81000 Podgorica, ME"}]
[null,{"$f":"IF('Podaci o računu'!C11<>\"\",\"\"&'Podaci o računu'!C11&\", E: \"&'Podaci o računu'!C12&\", T: \"&'Podaci o računu'!C13,\"\"&\"E: \"&'Podaci o računu'!C12&\", T: \"&'Podaci o računu'!C13)","v":"Jelena Milojković, E: info@zzi.co.me, T: 38220229560"}]
[null,{"$f":"IF('Podaci o računu'!C16=\"DA\",\"PDV ID: \"&'Podaci o računu'!C10&'Podaci o računu'!C15,\"Poreski Broj: \"&'Podaci o računu'!C15)","v":"PDV ID: ME02328097"}]
[null,{"$f":"\"IBAN: \"&'Podaci o računu'!C17&\", BIC: \"&'Podaci o računu'!C18","v":"IBAN: , BIC: "}]
[]
[null,"KUPAC",null,null,null,"PRIMALAC",null,null,null,{"$f":"'Podaci o računu'!G6&\" br. \"&'Podaci o računu'!G7","v":"Račun br. "}]
[null,{"$f":"'Podaci o računu'!C22","v":"ZZI doo Podgorica"},null,null,null,{"$f":"'Podaci o računu'!C36","v":"ZZI doo Podgorica"},null,null,null,"Datum izdavanja",null,null,{"$f":"TEXT('Podaci o računu'!G10,\"dd.mm.yyyy\")","v":"00.01.1900"}]
[null,{"$f":"'Podaci o računu'!C23","v":"Vladimir Ćetković"},null,null,null,{"$f":"'Podaci o računu'!C37","v":"Vladimir Ćetković"},null,null,null,"Datum usluge/isporuke robe",null,null,{"$f":"IF('Podaci o računu'!G12=\"\",\"-\",\"\"&TEXT('Podaci o računu'!G12,\"dd.mm.yyyy\"))","v":"-"}]
[null,{"$f":"'Podaci o računu'!C24","v":"ul. Moskovska 77"},null,null,null,{"$f":"'Podaci o računu'!C38","v":"ul. Moskovska 77"},null,null,null,"Razdoblje usluge",null,null,{"$f":"IF(OR('Podaci o računu'!G13=\"\",'Podaci o računu'!I13=\"\"),\"-\",\"\"&TEXT('Podaci o računu'!G13,\"dd.mm.yyyy\")&\" do \"&TEXT('Podaci o računu'!I13,\"dd.mm.yyyy\"))","v":"-"}]
[null,{"$f":"'Podaci o računu'!C25&\" \"&'Podaci o računu'!C26","v":"81000 Podgorica"},null,null,null,{"$f":"'Podaci o računu'!C39&\" \"&'Podaci o računu'!C40","v":"81000 Podgorica"},null,null,null,"Datum dospijeća",null,null,{"$f":"TEXT('Podaci o računu'!G11,\"dd.mm.yyyy\")","v":"00.01.1900"}]
[null,{"$f":"'Podaci o računu'!C27","v":"ME"},null,null,null,{"$f":"'Podaci o računu'!C41","v":"ME"},null,null,null,"Referentni dokument",null,null,{"$f":"'Podaci o računu'!G14&\" \"&'Podaci o računu'!G15","v":" "}]
[null,{"$f":"IF('Podaci o računu'!C30=\"DA\",\"PDV ID: \"&'Podaci o računu'!C27&'Podaci o računu'!C29,\"Poreski broj: \"&'Podaci o računu'!C29)","v":"PDV ID: ME02328097"},null,null,null,null,null,null,null,"Poziv na broj",null,null,{"$f":"IF('Podaci o računu'!G8=\"\",\"\",'Podaci o računu'!G8)","v":""}]
[null,{"$f":"'Podaci o računu'!C31&IF(AND('Podaci o računu'!C31<>\"\",'Podaci o računu'!C32<>\"\"),\", \",\"\")&'Podaci o računu'!C32","v":""},null,null,null,null,null,null,null,"Šifra namjene",null,null,{"$f":"'Podaci o računu'!G17","v":"OTHR"}]
[null,null,null,null,null,null,null,null,null,"Troškovno mjesto",null,null,{"$f":"IF('Podaci o računu'!G20=\"\",\"\",'Podaci o računu'!G20)","v":""}]
[]
{"$rows_left_out":42}
{"sheet":"Kupci","index":5,"n_rows":1003,"n_cols":16,"rows_kept":1003,"cut":false,"hidden":false,"merged":[]}
[null,"KUPCI",null,null,null,null,null,null,null,null,null,null,"bizBox Excel eRačun"]
[null,"ID","Naziv","Kontakt osoba","Adresa","Poštanski broj","Grad","Država","Matični broj","Poreski broj","Obveznik za PDV","IBAN","BIC","Šifra\nlokacije",null,"TEMP"]
[null,1,"ZZI doo","Polonca Plesec","Pot k sejmišču 33",1231,"Ljubljana - Črnuče","SI",5366569000,"SI85190586","DA",null,null,null,null,{"$f":"B3&IF(AND(C3=\"\",D3=\"\",E3=\"\"),\"\",\" - \")&C3&IF(OR(D3=\"\",C3=\"\"),\"\",\" - \")&D3","v":"1 - ZZI doo - Polonca Plesec"}]
[null,2,"ZZI doo Podgorica","Vladimir Ćetković","ul. Moskovska 77",81000,"Podgorica","ME","02328097","02328097","DA",null,null,null,null,{"$f":"B4&IF(AND(C4=\"\",D4=\"\",E4=\"\"),\"\",\" - \")&C4&IF(OR(D4=\"\",C4=\"\"),\"\",\" - \")&D4","v":"2 - ZZI doo Podgorica - Vladimir Ćetković"}]
[null,null,null,null,null,null,null,null,null,null,null,null,null,null,null,{"$f":"B5&IF(AND(C5=\"\",D5=\"\",E5=\"\"),\"\",\" - \")&C5&IF(OR(D5=\"\",C5=\"\"),\"\",\" - \")&D5","v":""}]
[null,null,null,null,null,null,null,null,null,null,null,null,null,null,null,{"$f":"B6&IF(AND(C6=\"\",D6=\"\",E6=\"\"),\"\",\" - \")&C6&IF(OR(D6=\"\",C6=\"\"),\"\",\" - \")&D6","v":""}]
[null,null,null,null,null,null,null,null,null,null,null,null,null,null,null,""]
[null,null,null,null,null,null,null,null,null,null,null,null,null,null,null,""]
[null,null,null,null,null,null,null,null,null,null,null,null,null,null,null,""]
[null,null,null,null,null,null,null,null,null,null,null,null,null,null,null,""]
[null,null,null,null,null,null,null,null,null,null,null,null,null,null,null,""]
[null,null,null,null,null,null,null,null,null,null,null,null,null,null,null,""]
[null,null,null,null,null,null,null,null,null,null,null,null,null,null,null,""]
[null,null,null,null,null,null,null,null,null,null,null,null,null,null,null,""]
[null,null,null,null,null,null,null,null,null,null,null,null,null,null,null,""]
{"$rows_left_out":989}
{"sheet":"Izdavaoci","index":6,"n_rows":17,"n_cols":5,"rows_kept":17,"cut":false,"hidden":false,"merged":[]}
[]
[null,"IZDAVAOCI RAČUNA",null,null,"bizBox Excel eRačun"]
[null,"Podatak","ZZI doo Podgorica","Preduzeće 2","Preduzeće 3"]
[null,"Naziv","ZZI doo Podgorica"]
[null,"Adresa","ul Moskovska 77"]
[null,"Poštanski broj",81000]
[null,"Grad","Podgorica"]
[null,"Država","ME"]
[null,"Kontakt osoba","Jelena Milojković"]
[null,"E-pošta","info@zzi.co.me"]
[null,"Telefon",38220229560]
[null,"Matični broj","02328097"]
[null,"Poreski broj","02328097"]
[null,"Obveznik za PDV","DA"]
[null,"IBAN"]
{"$rows_left_out":3}
{"sheet":"Artikli","index":7,"n_rows":1005,"n_cols":8,"rows_kept":1005,"cut":false,"hidden":false,"merged":[]}
[]
[null,"ARTIKLI",null,null,null,"bizBox Excel eRačun"]
[null,"ID","Naziv","Šifra","Jed.Mjere","Cijena",null,"temp"]
[null,1,"Prvi","abc-0001","W/h",100,null,{"$f":"B4","v":1}]
[null,2,"Drugi","abc-0002","kom",5.17,null,{"$f":"B5","v":2}]
[null,3,"Treći",null,"kom",19.989999999999998,null,3]
[null,4,"Četvrti","abc-0004","m3",15000,null,4]
[null,5,"Peti",null,"KW/h",5.0000000000000001E-3,null,5]
[null,6,"Šesti","abc-0006","Kg",12.811999999999999,null,6]
[null,7,null,null,null,null,null,7]
[null,8,null,null,null,null,null,8]
[null,9,null,null,null,null,null,9]
[null,10,null,null,null,null,null,10]
[null,11,null,null,null,null,null,11]
[null,12,null,null,null,null,null,12]
{"$rows_left_out":991}
{"sheet":"Šifranti","index":8,"n_rows":438,"n_cols":42,"rows_kept":438,"cut":false,"hidden":true,"merged":[]}
[null,"NAČIN PLAČILA",null,null,null,"DATUMI",null,null,null,"REFERENČNI DOKUMENT",null,"DDV",null,null,"FUNKCIJA RAČUNA ",null,null,"VRSTA DOKUMENTA",null,null,"KODA NAMENA",null,null,"DRŽAVE",null,null,"POPUST / PRIBITEK",null,"DDV PO DRŽAVAH",null,null,null,"DDV za izbrano državo",null,null,"ZAVEZANEC ZA DDV",null,"POSLOVNI PROCESI",null,null,"PDV-KOD"]
[null,"Opis","Koda",null,null,"Opis","Vrednost",null,null,"Opis",null,"Opis kode","Koda",null,"Opis kode","Koda",null,"Opis kode","Koda",null,"Opis kode","Koda",null,"Opis kode","Koda",null,"Opis",null,"Država","Opis kode","Koda",null,"Opis kode","Koda",null,"Opis",null,"Opis",null,null,"S","S – Standard rate (davčni stopnji 22% in 9,5%)"]
[null,"Račun je potrebno platiti",0,null,null,"Današnji dan",{"$f":"TODAY()","v":"2020-05-07"},null,null,"Dostavnica",null,22,22,null,"ORIGINAL",null,null,"Račun",380,null,"Upravljanje denarnih sredstev - znotraj banke","ACCT",null,"Slovenia","SI",null,"Popust",null,"SI",22,22,null,{"$f":"IFERROR(INDEX($AD$3:AD18, SMALL(IF('Podaci o računu'!$C$10=$AC$3:AC18, ROW(Šifranti!$AD$3:AD18)-2,\"\"), ROW()-2)),\"\")","v":21},{"$f":"IFERROR(INDEX($AE$3:AE18, SMALL(IF('Podaci o računu'!$C$10=$AC$3:AC18, ROW(Šifranti!$AE$3:AE18)-2,\"\"), ROW()-2)),\"\")","v":21},null,"DA",null,"P1",null,null,"Z","Z – Zero rated goods"]
[null,"Račun će se platiti direktnim zaduženjem i nije potrebno platiti",1,null,null,"Početak vremenskog razdoblja","1970-01-01",null,null,"Narudžba",null,9.5,9.5,null,"KOPIJA",null,null,"Kredit",381,null,"Plačilo vnaprej/predplačilo","ADVA",null,"Croatia","HR",null,"Pribitek",null,"SI",9.5,9.5,null,{"$f":"IFERROR(INDEX($AD$3:AD19, SMALL(IF('Podaci o računu'!$C$10=$AC$3:AC19, ROW(Šifranti!$AD$3:AD19)-2,\"\"), ROW()-2)),\"\")","v":7},{"$f":"IFERROR(INDEX($AE$3:AE19, SMALL(IF('Podaci o računu'!$C$10=$AC$3:AC19, ROW(Šifranti!$AE$3:AE19)-2,\"\"), ROW()-2)),\"\")","v":7},null,"NE",null,"P2",null,null,"E","E – Exempt from tax"]
[null,"Račun je već plaćen",2,null,null,null,null,null,null,"Ugovor",null,0,0,null,null,null,null,"Predračun",325,null,"Administrativne storitve","ADMG",null,"Czechia","CZ",null,null,null,"SI",0,0,null,{"$f":"IFERROR(INDEX($AD$3:AD20, SMALL(IF('Podaci o računu'!$C$10=$AC$3:AC20, ROW(Šifranti!$AD$3:AD20)-2,\"\"), ROW()-2)),\"\")","v":0},{"$f":"IFERROR(INDEX($AE$3:AE20, SMALL(IF('Podaci o računu'!$C$10=$AC$3:AC20, ROW(Šifranti!$AE$3:AE20)-2,\"\"), ROW()-2)),\"\")","v":0},null,null,null,"P3",null,null,"AE","AE – VAT Reverse Charge "]
[null,"Drugo - ne postoji opcija plaćanja",3,null,null,null,null,null,null,"Prodajni nalog",null,"22 (76.a člen)",0,null,null,null,null,"Avansni račun",386,null,"Aktivna politika zaposlovanja","AEMP",null,"Montenegro","ME",null,null,null,"SI","22 (76.a člen)",0,null,{"$f":"IFERROR(INDEX($AD$3:AD21, SMALL(IF('Podaci o računu'!$C$10=$AC$3:AC21, ROW(Šifranti!$AD$3:AD21)-2,\"\"), ROW()-2)),\"\")","v":""},{"$f":"IFERROR(INDEX($AE$3:AE21, SMALL(IF('Podaci o računu'!$C$10=$AC$3:AC21, ROW(Šifranti!$AE$3:AE21)-2,\"\"), ROW()-2)),\"\")","v":""},null,null,null,"P4",null,null,"K","K – VAT exempt for EEA intra-community supply of goods and services"]
[null,null,null,null,null,null,null,null,null,"Prijemnica",null,"9,5 (76.a člen)",0,null,null,null,null,null,null,null,"Plačilo v kmetijstvu","AGRT",null,"Åland Islands","AX",null,null,null,"SI","9,5 (76.a člen)",0,null,{"$f":"IFERROR(INDEX($AD$3:AD22, SMALL(IF('Podaci o računu'!$C$10=$AC$3:AC22, ROW(Šifranti!$AD$3:AD22)-2,\"\"), ROW()-2)),\"\")","v":""},null,null,null,null,"P5",null,null,"G","G – Free export item, tax not charged"]
[null,null,null,null,null,null,null,null,null,"Projekat",null,null,null,null,null,null,null,null,null,null,"Zračni prevoz","AIRB",null,"Albania","AL",null,null,null,"HR",25,25,null,null,null,null,null,null,"P6",null,null,"O","O – Services outside scope of tax"]
[null,null,null,null,null,null,null,null,null,"Eksterni objekat",null,null,null,null,null,null,null,null,null,null,"Preživnina","ALMY",null,"Algeria","DZ",null,null,null,"HR",13,13,null,null,null,null,null,null,"P7"]
[null,null,null,null,null,null,null,null,null,null,null,null,null,null,null,null,null,null,null,null,"Plačilo obroka kredita/zavarovanja","ANNI",null,"American Samoa","AS",null,null,null,"HR",5,5,null,null,null,null,null,null,"P8"]
[null,null,null,null,null,null,null,null,null,null,null,null,null,null,null,null,null,null,null,null,"Storitve anestezije","ANTS",null,"Andorra","AD",null,null,null,"HR",0,0,null,null,null,null,null,null,"P9"]
[null,null,null,null,null,null,null,null,null,null,null,null,null,null,null,null,null,null,null,null,"Vnos/vpis terjatev","AREN",null,"Angola","AO",null,null,null,"ME",21,21,null,null,null,null,null,null,"P10"]
[null,null,null,null,null,null,null,null,null,null,null,null,null,null,null,null,null,null,null,null,"Otroški dodatek","BECH",null,"Anguilla","AI",null,null,null,"ME",7,7,null,null,null,null,null,null,"P11"]
[null,null,null,null,null,null,null,null,null,null,null,null,null,null,null,null,null,null,null,null,"Podpora za brezposelne/invalide","BENE",null,"Antarctica","AQ",null,null,null,"ME",0,0,null,null,null,null,null,null,"P12"]
[null,null,null,null,null,null,null,null,null,null,null,null,null,null,null,null,null,null,null,null,"Poslovni izdatki","BEXP",null,"Antigua and Barbuda","AG",null,null,null,"CZ",21,21]
{"$rows_left_out":423}